Reaction Details
TargetCasein kinase I isoform delta
LigandBDBM50300893
Substrate/Competitorn/a
Meas. Tech.ChEMBL_599890 (CHEMBL1045455)
IC50 5±n/a nM
Citation Peifer, CAbadleh, MBischof, JHauser, DSchattel, VHirner, HKnippschild, ULaufer, S 3,4-Diaryl-isoxazoles and -imidazoles as potent dual inhibitors of p38alpha mitogen activated protein kinase and casein kinase 1delta. J Med Chem52:7618-30 (2009) 
 
Casein kinase I isoform delta
Name:Casein kinase I isoform delta
Type:Enzyme
Mol. Mass.:47356.76
Organism:Homo sapiens (Human)
Description:P48730
Residue:415
BDBM50300893
NameBDBM50300893
Synonyms:(E)-3-(2,4-Dimethoxy-phenyl)-N-(4-[5-(4-fluoro-phenyl)-2-methanesulfinyl-3H-imidazol-4-yl]-pyridin-2-yl)-acrylamide | CHEMBL572006
TypeSmall organic molecule
Emp. Form.C26H23FN4O4S
Mol. Mass.506.549
SMILESCOc1ccc(C=CC(=O)Nc2cc(ccn2)-c2nc([nH]c2-c2ccc(F)cc2)S(C)=O)c(OC)c1