Reaction Details
TargetC-X-C chemokine receptor type 3
LigandBDBM50300901
Substrate/Competitorn/a
Meas. Tech.ChEMBL_600878 (CHEMBL1042836)
IC50 10±n/a nM
Citation Du, XGustin, DJChen, XDuquette, JMcGee, LRWang, ZEbsworth, KHenne, KLemon, BMa, JMiao, SSabalan, ESullivan, TJTonn, GCollins, TLMedina, JC Imidazo-pyrazine derivatives as potent CXCR3 antagonists. Bioorg Med Chem Lett19:5200-4 (2009) 
 
C-X-C chemokine receptor type 3
Name:C-X-C chemokine receptor type 3
Type:Enzyme Catalytic Domain
Mol. Mass.:40665.65
Organism:Homo sapiens (Human)
Description:n/a
Residue:368
BDBM50300901
NameBDBM50300901
Synonyms:(R)-N-(1-(3-(4-cyanophenyl)-8-methylimidazo[1,2-a]pyrazin-2-yl)ethyl)-N-(2-(ethylsulfonyl)ethyl)-2-(3-fluoro-4-(trifluoromethyl)phenyl)acetamide | CHEMBL578188
TypeSmall organic molecule
Emp. Form.C29H27F4N5O3S
Mol. Mass.601.615
SMILESCCS(=O)(=O)CCN([C@H](C)c1nc2c(C)nccn2c1-c1ccc(cc1)C#N)C(=O)Cc1ccc(c(F)c1)C(F)(F)F