Reaction Details
TargetC-X-C chemokine receptor type 3
LigandBDBM50300911
Substrate/Competitorn/a
Meas. Tech.ChEMBL_600877 (CHEMBL1042835)
IC50 4±n/a nM
Citation Du, XGustin, DJChen, XDuquette, JMcGee, LRWang, ZEbsworth, KHenne, KLemon, BMa, JMiao, SSabalan, ESullivan, TJTonn, GCollins, TLMedina, JC Imidazo-pyrazine derivatives as potent CXCR3 antagonists. Bioorg Med Chem Lett19:5200-4 (2009) 
 
C-X-C chemokine receptor type 3
Name:C-X-C chemokine receptor type 3
Type:Enzyme Catalytic Domain
Mol. Mass.:40665.65
Organism:Homo sapiens (Human)
Description:n/a
Residue:368
BDBM50300911
NameBDBM50300911
Synonyms:(R)-N-(1-(3-(4-cyanophenyl)-7-methoxy-4-oxo-3,4-dihydropyrido[2,3-d]pyrimidin-2-yl)ethyl)-N-(2-(ethylsulfonyl)ethyl)-2-(4-fluoro-3-(trifluoromethyl)phenyl)acetamide | CHEMBL571081
TypeSmall organic molecule
Emp. Form.C30H27F4N5O5S
Mol. Mass.645.624
SMILESCCS(=O)(=O)CCN([C@H](C)c1nc2nc(OC)ccc2c(=O)n1-c1ccc(cc1)C#N)C(=O)Cc1ccc(F)c(c1)C(F)(F)F