Reaction Details
TargetcGMP-specific 3',5'-cyclic phosphodiesterase
LigandBDBM50300959
Substrate/Competitorn/a
Meas. Tech.ChEMBL_597959 (CHEMBL1042744)
IC50 1.2±n/a nM
Citation Hughes, ROWalker, JKRogier, DJHeasley, SEBlevis-Bal, RMBenson, AGJacobsen, EJCubbage, JWFobian, YMOwen, DRFreskos, JNMolyneaux, JMBrown, DLAcker, BAMaddux, TMTollefson, MBMoon, JBMischke, BVRumsey, JMZheng, YMacInnes, ABond, BRYu, Y Optimization of the aminopyridopyrazinones class of PDE5 inhibitors: discovery of 3-[(trans-4-hydroxycyclohexyl)amino]-7-(6-methoxypyridin-3-yl)-1-(2-propoxyethyl)pyrido[3,4-b]pyrazin-2(1H)-one. Bioorg Med Chem Lett19:5209-13 (2009) 
 
cGMP-specific 3',5'-cyclic phosphodiesterase
Name:cGMP-specific 3',5'-cyclic phosphodiesterase
Type:Protein
Mol. Mass.:99975.83
Organism:Homo sapiens (Human)
Description:O76074
Residue:875
BDBM50300959
NameBDBM50300959
Synonyms:3-(2-hydroxyethylamino)-7-(6-methoxypyridin-3-yl)-1-(2-propoxyethyl)pyrido[2,3-b]pyrazin-2(1H)-one | CHEMBL567255
TypeSmall organic molecule
Emp. Form.C20H25N5O4
Mol. Mass.399.4436
SMILESCCCOCCn1c2cc(cnc2nc(NCCO)c1=O)-c1ccc(OC)nc1