Reaction Details
TargetHigh affinity cAMP-specific and IBMX-insensitive 3',5'-cyclic phosphodiesterase 8A
LigandBDBM50296256
Substrate/Competitorn/a
Meas. Tech.ChEMBL_597987 (CHEMBL1045418)
IC50>2000±n/a nM
Citation Hughes, ROWalker, JKRogier, DJHeasley, SEBlevis-Bal, RMBenson, AGJacobsen, EJCubbage, JWFobian, YMOwen, DRFreskos, JNMolyneaux, JMBrown, DLAcker, BAMaddux, TMTollefson, MBMoon, JBMischke, BVRumsey, JMZheng, YMacInnes, ABond, BRYu, Y Optimization of the aminopyridopyrazinones class of PDE5 inhibitors: discovery of 3-[(trans-4-hydroxycyclohexyl)amino]-7-(6-methoxypyridin-3-yl)-1-(2-propoxyethyl)pyrido[3,4-b]pyrazin-2(1H)-one. Bioorg Med Chem Lett19:5209-13 (2009) 
 
High affinity cAMP-specific and IBMX-insensitive 3',5'-cyclic phosphodiesterase 8A
Name:High affinity cAMP-specific and IBMX-insensitive 3',5'-cyclic phosphodiesterase 8A
Type:Enzyme Catalytic Domain
Mol. Mass.:93295.89
Organism:Homo sapiens (Human)
Description:Recombinant catalytic domain (M1-E829) of human PDE8A.
Residue:829
BDBM50296256
NameBDBM50296256
Synonyms:7-(6-methoxypyridin-3-yl)-3-(2-morpholinoethylamino)-1-(2-propoxyethyl)pyrido[3,4-b]pyrazin-2(1H)-one | CHEMBL551052
TypeSmall organic molecule
Emp. Form.C24H32N6O4
Mol. Mass.468.5487
SMILESCCCOCCn1c2cc(ncc2nc(NCCN2CCOCC2)c1=O)-c1ccc(OC)nc1