Reaction Details
TargetRod cGMP-specific 3',5'-cyclic phosphodiesterase subunit alpha
LigandBDBM50300986
Substrate/Competitorn/a
Meas. Tech.ChEMBL_597960 (CHEMBL1042745)
IC50 124±n/a nM
Citation Hughes, ROWalker, JKRogier, DJHeasley, SEBlevis-Bal, RMBenson, AGJacobsen, EJCubbage, JWFobian, YMOwen, DRFreskos, JNMolyneaux, JMBrown, DLAcker, BAMaddux, TMTollefson, MBMoon, JBMischke, BVRumsey, JMZheng, YMacInnes, ABond, BRYu, Y Optimization of the aminopyridopyrazinones class of PDE5 inhibitors: discovery of 3-[(trans-4-hydroxycyclohexyl)amino]-7-(6-methoxypyridin-3-yl)-1-(2-propoxyethyl)pyrido[3,4-b]pyrazin-2(1H)-one. Bioorg Med Chem Lett19:5209-13 (2009) 
 
Rod cGMP-specific 3',5'-cyclic phosphodiesterase subunit alpha
Name:Rod cGMP-specific 3',5'-cyclic phosphodiesterase subunit alpha
Type:PROTEIN
Mol. Mass.:99531.10
Organism:Homo sapiens (Human)
Description:ChEMBL_1347866
Residue:860
BDBM50300986
NameBDBM50300986
Synonyms:3-(3-hydroxypropylamino)-7-(6-methoxypyridin-3-yl)-1-(2-propoxyethyl)pyrido[2,3-b]pyrazin-2(1H)-one | CHEMBL583835
TypeSmall organic molecule
Emp. Form.C21H27N5O4
Mol. Mass.413.4702
SMILESCCCOCCn1c2cc(cnc2nc(NCCCO)c1=O)-c1ccc(OC)nc1