Reaction Details
TargetHistone-arginine methyltransferase CARM1
LigandBDBM50301075
Substrate/Competitorn/a
Meas. Tech.ChEMBL_598368 (CHEMBL1037272)
IC50 0.700000±n/a nM
Citation Wan, HHuynh, TPang, SGeng, JVaccaro, WPoss, MATrainor, GLLorenzi, MVGottardis, MJayaraman, LPurandare, AV Benzo[d]imidazole inhibitors of Coactivator Associated Arginine Methyltransferase 1 (CARM1)--Hit to Lead studies. Bioorg Med Chem Lett19:5063-6 (2009) 
 
Histone-arginine methyltransferase CARM1
Name:Histone-arginine methyltransferase CARM1
Type:Protein
Mol. Mass.:65855.47
Organism:Homo sapiens (Human)
Description:Q86X55
Residue:608
BDBM50301075
NameBDBM50301075
Synonyms:2-(4-(2-(2-methoxypyridin-3-yl)-3H-imidazo[4,5-b]pyridin-6-yl)piperidin-1-yl)-N-methylethanamine | CHEMBL571431
TypeSmall organic molecule
Emp. Form.C20H26N6O
Mol. Mass.366.46
SMILESCNCCN1CCC(CC1)c1cnc2nc([nH]c2c1)-c1cccnc1OC