Reaction Details
TargetMelanin-concentrating hormone receptor 1
LigandBDBM50301092
Substrate/Competitorn/a
Meas. Tech.ChEMBL_598541 (CHEMBL1043533)
IC50 3.5±n/a nM
Citation Ando, MSekino, EHaga, YMoriya, MIto, MIto, JIwaasa, HIshihara, AKanatani, AOhtake, N Discovery of novel phenethylpyridone derivatives as potent melanin-concentrating hormone 1 receptor antagonists. Bioorg Med Chem Lett19:5186-90 (2009) 
 
Melanin-concentrating hormone receptor 1
Name:Melanin-concentrating hormone receptor 1
Type:G Protein-Coupled Receptor (GPCR)
Mol. Mass.:45976.27
Organism:Homo sapiens (Human)
Description:Membranes from CHO-K1 cells stably expressing human MCH1R were used in assays.
Residue:422
BDBM50301092
NameBDBM50301092
Synonyms:1-(4-((cyclopentyl(propyl)amino)methyl)phenethyl)-4-(4-fluorobenzyloxy)pyridin-2(1H)-one | CHEMBL569852
TypeSmall organic molecule
Emp. Form.C29H35FN2O2
Mol. Mass.462.5988
SMILESCCCN(Cc1ccc(CCn2ccc(OCc3ccc(F)cc3)cc2=O)cc1)C1CCCC1