Reaction Details
TargetMelanin-concentrating hormone receptor 1
LigandBDBM50301094
Substrate/Competitorn/a
Meas. Tech.ChEMBL_598541 (CHEMBL1043533)
IC50 3.5±n/a nM
Citation Ando, MSekino, EHaga, YMoriya, MIto, MIto, JIwaasa, HIshihara, AKanatani, AOhtake, N Discovery of novel phenethylpyridone derivatives as potent melanin-concentrating hormone 1 receptor antagonists. Bioorg Med Chem Lett19:5186-90 (2009) 
 
Melanin-concentrating hormone receptor 1
Name:Melanin-concentrating hormone receptor 1
Type:G Protein-Coupled Receptor (GPCR)
Mol. Mass.:45976.27
Organism:Homo sapiens (Human)
Description:Membranes from CHO-K1 cells stably expressing human MCH1R were used in assays.
Residue:422
BDBM50301094
NameBDBM50301094
Synonyms:4-(4-fluorobenzyloxy)-1-(4-((methyl(propyl)amino)methyl)phenethyl)pyridin-2(1H)-one | CHEMBL572090
TypeSmall organic molecule
Emp. Form.C25H29FN2O2
Mol. Mass.408.5084
SMILESCCCN(C)Cc1ccc(CCn2ccc(OCc3ccc(F)cc3)cc2=O)cc1