Reaction Details
TargetTGF-beta receptor type-1
LigandBDBM50151346
Substrate/Competitorn/a
Meas. Tech.ChEMBL_598612 (CHEMBL1048115)
IC50 20±n/a nM
Citation Ren, JXLi, LLZou, JYang, LYang, JLYang, SY Pharmacophore modeling and virtual screening for the discovery of new transforming growth factor-beta type I receptor (ALK5) inhibitors. Eur J Med Chem44:4259-65 (2009) 
 
TGF-beta receptor type-1
Name:TGF-beta receptor type-1
Type:enzyme
Mol. Mass.:55968.24
Organism:Homo sapiens (Human)
Description:P36897
Residue:503
BDBM50151346
NameBDBM50151346
Synonyms:5-(1,5-naphthyridin-2-yl)-4-(pyridin-2-yl)thiazol-2-amine CHEMBL181361
TypeSmall organic molecule
Emp. Form.C16H11N5S
Mol. Mass.305.357
SMILESNc1nc(c(s1)-c1ccc2ncccc2n1)-c1ccccn1