Reaction Details
TargetTGF-beta receptor type-1
LigandBDBM50301171
Substrate/Competitorn/a
Meas. Tech.ChEMBL_598612 (CHEMBL1048115)
IC50 30±n/a nM
Citation Ren, JXLi, LLZou, JYang, LYang, JLYang, SY Pharmacophore modeling and virtual screening for the discovery of new transforming growth factor-beta type I receptor (ALK5) inhibitors. Eur J Med Chem44:4259-65 (2009) 
 
TGF-beta receptor type-1
Name:TGF-beta receptor type-1
Type:enzyme
Mol. Mass.:55968.24
Organism:Homo sapiens (Human)
Description:P36897
Residue:503
BDBM50301171
NameBDBM50301171
Synonyms:5-(8-methylquinolin-2-yl)-4-(pyridin-2-yl)thiazol-2-amine | CHEMBL565643
TypeSmall organic molecule
Emp. Form.C18H14N4S
Mol. Mass.318.396
SMILESCc1cccc2ccc(nc12)-c1sc(N)nc1-c1ccccn1