Reaction Details
TargetTGF-beta receptor type-1
LigandBDBM50184874
Substrate/Competitorn/a
Meas. Tech.ChEMBL_598612 (CHEMBL1048115)
IC50 40±n/a nM
Citation Ren, JXLi, LLZou, JYang, LYang, JLYang, SY Pharmacophore modeling and virtual screening for the discovery of new transforming growth factor-beta type I receptor (ALK5) inhibitors. Eur J Med Chem44:4259-65 (2009) 
 
TGF-beta receptor type-1
Name:TGF-beta receptor type-1
Type:enzyme
Mol. Mass.:55968.24
Organism:Homo sapiens (Human)
Description:P36897
Residue:503
BDBM50184874
NameBDBM50184874
Synonyms:2-[4-(2-pyrrolidin-1-ylethoxy)phenyl]-4-(3-pyridin-2-yl-1Hpyrazol-4-yl)pyridine CHEMBL202994
TypeSmall organic molecule
Emp. Form.C25H25N5O
Mol. Mass.411.4989
SMILESC(CN1CCCC1)Oc1ccc(cc1)-c1cc(ccn1)-c1c[nH]nc1-c1ccccn1