Reaction Details
TargetTGF-beta receptor type-1
LigandBDBM50148666
Substrate/Competitorn/a
Meas. Tech.ChEMBL_598612 (CHEMBL1048115)
IC50 48±n/a nM
Citation Ren, JXLi, LLZou, JYang, LYang, JLYang, SY Pharmacophore modeling and virtual screening for the discovery of new transforming growth factor-beta type I receptor (ALK5) inhibitors. Eur J Med Chem44:4259-65 (2009) 
 
TGF-beta receptor type-1
Name:TGF-beta receptor type-1
Type:enzyme
Mol. Mass.:55968.24
Organism:Homo sapiens (Human)
Description:P36897
Residue:503
BDBM50148666
NameBDBM50148666
Synonyms:7-Chloro-4-[2-(6-methyl-pyridin-2-yl)-5,6-dihydro-4H-pyrrolo[1,2-b]pyrazol-3-yl]-quinoline CHEMBL332344
TypeSmall organic molecule
Emp. Form.C21H17ClN4
Mol. Mass.360.839
SMILESCc1cccc(n1)-c1nn2CCCc2c1-c1ccnc2cc(Cl)ccc12