Reaction Details
TargetTGF-beta receptor type-1
LigandBDBM50301182
Substrate/Competitorn/a
Meas. Tech.ChEMBL_598612 (CHEMBL1048115)
IC50 75±n/a nM
Citation Ren, JXLi, LLZou, JYang, LYang, JLYang, SY Pharmacophore modeling and virtual screening for the discovery of new transforming growth factor-beta type I receptor (ALK5) inhibitors. Eur J Med Chem44:4259-65 (2009) 
 
TGF-beta receptor type-1
Name:TGF-beta receptor type-1
Type:enzyme
Mol. Mass.:55968.24
Organism:Homo sapiens (Human)
Description:P36897
Residue:503
BDBM50301182
NameBDBM50301182
Synonyms:4-((5-(6-methylpyridin-2-yl)-4-(1,4,4a,8a-tetrahydroquinoxalin-6-yl)-1H-imidazol-2-yl)methylamino)benzamide | CHEMBL565422
TypeSmall organic molecule
Emp. Form.C25H25N7O
Mol. Mass.439.5123
SMILESCc1cccc(n1)-c1nc(CNc2ccc(cc2)C(N)=O)[nH]c1C1=CC2N=CCNC2C=C1