Reaction Details
TargetTGF-beta receptor type-1
LigandBDBM50184898
Substrate/Competitorn/a
Meas. Tech.ChEMBL_598612 (CHEMBL1048115)
IC50 81±n/a nM
Citation Ren, JXLi, LLZou, JYang, LYang, JLYang, SY Pharmacophore modeling and virtual screening for the discovery of new transforming growth factor-beta type I receptor (ALK5) inhibitors. Eur J Med Chem44:4259-65 (2009) 
 
TGF-beta receptor type-1
Name:TGF-beta receptor type-1
Type:enzyme
Mol. Mass.:55968.24
Organism:Homo sapiens (Human)
Description:P36897
Residue:503
BDBM50184898
NameBDBM50184898
Synonyms:2-(4-(2-cyclohexylethoxy)phenyl)-4-(3-(pyridin-2-yl)-1H-pyrazol-4-yl)pyridine CHEMBL379700
TypeSmall organic molecule
Emp. Form.C27H28N4O
Mol. Mass.424.5374
SMILESC(CC1CCCCC1)Oc1ccc(cc1)-c1cc(ccn1)-c1c[nH]nc1-c1ccccn1