Reaction Details
TargetTGF-beta receptor type-1
LigandBDBM50132980
Substrate/Competitorn/a
Meas. Tech.ChEMBL_598612 (CHEMBL1048115)
IC50 91±n/a nM
Citation Ren, JXLi, LLZou, JYang, LYang, JLYang, SY Pharmacophore modeling and virtual screening for the discovery of new transforming growth factor-beta type I receptor (ALK5) inhibitors. Eur J Med Chem44:4259-65 (2009) 
 
TGF-beta receptor type-1
Name:TGF-beta receptor type-1
Type:enzyme
Mol. Mass.:55968.24
Organism:Homo sapiens (Human)
Description:P36897
Residue:503
BDBM50132980
NameBDBM50132980
Synonyms:4-(3-(5-fluoropyridin-2-yl)-1H-pyrazol-4-yl)quinoline CHEMBL340203
TypeSmall organic molecule
Emp. Form.C17H11FN4
Mol. Mass.290.2944
SMILESFc1ccc(nc1)-c1n[nH]cc1-c1ccnc2ccccc12