Reaction Details
TargetCarboxypeptidase A1
LigandBDBM50301283
Substrate/Competitorn/a
Meas. Tech.ChEMBL_599273 (CHEMBL1041001)
Ki 160±n/a nM
Citation Wang, SFTian, GRZhang, WZJin, JY Characterization of alpha-nitromethyl ketone as a new zinc-binding group based on structural analysis of its complex with carboxypeptidase A. Bioorg Med Chem Lett19:5009-11 (2009) 
 
Carboxypeptidase A1
Name:Carboxypeptidase A1
Type:PROTEIN
Mol. Mass.:47132.61
Organism:Homo sapiens (Human)
Description:ChEMBL_1496378
Residue:419
BDBM50301283
NameBDBM50301283
Synonyms:(R)-2-benzyl-5-nitro-4-oxopentanoic acid | CHEMBL571509
TypeSmall organic molecule
Emp. Form.C12H13NO5
Mol. Mass.251.2353
SMILESOC(=O)[C@@H](CC(=O)C[N+]([O-])=O)Cc1ccccc1