Reaction Details
TargetCannabinoid receptor 2
LigandBDBM50301312
Substrate/Competitorn/a
Meas. Tech.ChEMBL_599309 (CHEMBL1041037)
EC50 14±n/a nM
Citation Worm, KWeaver, DGGreen, RCSaeui, CTDulay, DMBarker, WMCassel, JAStabley, GJDeHaven, RNLaBuda, CJKoblish, MBrogdon, BLSmith, SADolle, RE Discovery of N-(3-(morpholinomethyl)-phenyl)-amides as potent and selective CB2 agonists. Bioorg Med Chem Lett19:5004-8 (2009) 
 
Cannabinoid receptor 2
Name:Cannabinoid receptor 2
Type:G Protein-Coupled Receptor (GPCR)
Mol. Mass.:39690.94
Organism:Homo sapiens (Human)
Description:P34972
Residue:360
BDBM50301312
NameBDBM50301312
Synonyms:3,3-difluoro-2-methyl-N-(4-methyl-3-(morpholinomethyl)phenyl)-2-(trifluoromethyl)butanamide | CHEMBL576855
TypeSmall organic molecule
Emp. Form.C17H20F6N2O2
Mol. Mass.398.3433
SMILESCc1ccc(NC(=O)C(C)(C(F)(F)F)C(F)(F)F)cc1CN1CCOCC1