Reaction Details
TargetCannabinoid receptor 2
LigandBDBM50301314
Substrate/Competitorn/a
Meas. Tech.ChEMBL_599309 (CHEMBL1041037)
EC50 110±n/a nM
Citation Worm, KWeaver, DGGreen, RCSaeui, CTDulay, DMBarker, WMCassel, JAStabley, GJDeHaven, RNLaBuda, CJKoblish, MBrogdon, BLSmith, SADolle, RE Discovery of N-(3-(morpholinomethyl)-phenyl)-amides as potent and selective CB2 agonists. Bioorg Med Chem Lett19:5004-8 (2009) 
 
Cannabinoid receptor 2
Name:Cannabinoid receptor 2
Type:G Protein-Coupled Receptor (GPCR)
Mol. Mass.:39690.94
Organism:Homo sapiens (Human)
Description:P34972
Residue:360
BDBM50301314
NameBDBM50301314
Synonyms:2,2-dimethyl-N-(4-methyl-3-(morpholinomethyl)phenyl)butanamide | CHEMBL565417
TypeSmall organic molecule
Emp. Form.C18H28N2O2
Mol. Mass.304.4271
SMILESCCC(C)(C)C(=O)Nc1ccc(C)c(CN2CCOCC2)c1