Reaction Details
TargetCannabinoid receptor 2
LigandBDBM50301315
Substrate/Competitorn/a
Meas. Tech.ChEMBL_599309 (CHEMBL1041037)
EC50 5.5±n/a nM
Citation Worm, KWeaver, DGGreen, RCSaeui, CTDulay, DMBarker, WMCassel, JAStabley, GJDeHaven, RNLaBuda, CJKoblish, MBrogdon, BLSmith, SADolle, RE Discovery of N-(3-(morpholinomethyl)-phenyl)-amides as potent and selective CB2 agonists. Bioorg Med Chem Lett19:5004-8 (2009) 
 
Cannabinoid receptor 2
Name:Cannabinoid receptor 2
Type:G Protein-Coupled Receptor (GPCR)
Mol. Mass.:39690.94
Organism:Homo sapiens (Human)
Description:P34972
Residue:360
BDBM50301315
NameBDBM50301315
Synonyms:CHEMBL568467 | N-(3,4-dimethyl-5-(morpholinomethyl)phenyl)-3,3-difluoro-2-methyl-2-(trifluoromethyl)butanamide
TypeSmall organic molecule
Emp. Form.C18H22F6N2O2
Mol. Mass.412.3699
SMILESCc1cc(NC(=O)C(C)(C(F)(F)F)C(F)(F)F)cc(CN2CCOCC2)c1C