Reaction Details
TargetCannabinoid receptor 1
LigandBDBM50301318
Substrate/Competitorn/a
Meas. Tech.ChEMBL_599307 (CHEMBL1041035)
Ki 1400±n/a nM
Citation Worm, KWeaver, DGGreen, RCSaeui, CTDulay, DMBarker, WMCassel, JAStabley, GJDeHaven, RNLaBuda, CJKoblish, MBrogdon, BLSmith, SADolle, RE Discovery of N-(3-(morpholinomethyl)-phenyl)-amides as potent and selective CB2 agonists. Bioorg Med Chem Lett19:5004-8 (2009) 
 
Cannabinoid receptor 1
Name:Cannabinoid receptor 1
Type:G Protein-Coupled Receptor (GPCR)
Mol. Mass.:52868.96
Organism:Homo sapiens (Human)
Description:P21554
Residue:472
BDBM50301318
NameBDBM50301318
Synonyms:4-methyl-3-(2-morpholinoethyl)-N-((1S,4R)-1,3,3-trimethylbicyclo[2.2.1]heptan-2-yl)benzamide | CHEMBL567593
TypeSmall organic molecule
Emp. Form.C24H36N2O2
Mol. Mass.384.5548
SMILESCc1ccc(cc1CCN1CCOCC1)C(=O)NC1[C@@]2(C)CC[C@H](C2)C1(C)C