Reaction Details
TargetCannabinoid receptor 2
LigandBDBM50277153
Substrate/Competitorn/a
Meas. Tech.ChEMBL_599308 (CHEMBL1041036)
Ki 3.9±n/a nM
Citation Worm, KWeaver, DGGreen, RCSaeui, CTDulay, DMBarker, WMCassel, JAStabley, GJDeHaven, RNLaBuda, CJKoblish, MBrogdon, BLSmith, SADolle, RE Discovery of N-(3-(morpholinomethyl)-phenyl)-amides as potent and selective CB2 agonists. Bioorg Med Chem Lett19:5004-8 (2009) 
 
Cannabinoid receptor 2
Name:Cannabinoid receptor 2
Type:G Protein-Coupled Receptor (GPCR)
Mol. Mass.:39690.94
Organism:Homo sapiens (Human)
Description:P34972
Residue:360
BDBM50277153
NameBDBM50277153
Synonyms:4-methyl-3-(morpholinosulfonyl)-N-((1S,2R,4R)-1,3,3-trimethylbicyclo[2.2.1]heptan-2-yl)benzamide | CHEMBL473063
TypeSmall organic molecule
Emp. Form.C22H32N2O4S
Mol. Mass.420.565
SMILESCc1ccc(cc1S(=O)(=O)N1CCOCC1)C(=O)N[C@@H]1[C@@]2(C)CC[C@H](C2)C1(C)C