Reaction Details
TargetCannabinoid receptor 1
LigandBDBM50301313
Substrate/Competitorn/a
Meas. Tech.ChEMBL_599307 (CHEMBL1041035)
Ki 1600±n/a nM
Citation Worm, KWeaver, DGGreen, RCSaeui, CTDulay, DMBarker, WMCassel, JAStabley, GJDeHaven, RNLaBuda, CJKoblish, MBrogdon, BLSmith, SADolle, RE Discovery of N-(3-(morpholinomethyl)-phenyl)-amides as potent and selective CB2 agonists. Bioorg Med Chem Lett19:5004-8 (2009) 
 
Cannabinoid receptor 1
Name:Cannabinoid receptor 1
Type:G Protein-Coupled Receptor (GPCR)
Mol. Mass.:52868.96
Organism:Homo sapiens (Human)
Description:P21554
Residue:472
BDBM50301313
NameBDBM50301313
Synonyms:2-methyl-N-(4-methyl-3-(morpholinomethyl)phenyl)cyclohexanecarboxamide | CHEMBL577686
TypeSmall organic molecule
Emp. Form.C20H30N2O2
Mol. Mass.330.4644
SMILESCC1CCCCC1C(=O)Nc1ccc(C)c(CN2CCOCC2)c1