Reaction Details
TargetC-X-C chemokine receptor type 3
LigandBDBM50301335
Substrate/Competitorn/a
Meas. Tech.ChEMBL_599490 (CHEMBL1049026)
IC50 20±n/a nM
Citation McGuinness, BFCarroll, CDZawacki, LGDong, GYang, CHobbs, DWJacob-Samuel, BHall, JWJenh, CHKozlowski, JAAnilkumar, GNRosenblum, SB Novel CXCR3 antagonists with a piperazinyl-piperidine core. Bioorg Med Chem Lett19:5205-8 (2009) 
 
C-X-C chemokine receptor type 3
Name:C-X-C chemokine receptor type 3
Type:Enzyme Catalytic Domain
Mol. Mass.:40665.65
Organism:Homo sapiens (Human)
Description:n/a
Residue:368
BDBM50301335
NameBDBM50301335
Synonyms:5-chloro-6-(4-(1-(4-cyanobenzyl)piperidin-4-yl)piperazin-1-yl)-N-(2-phenoxyethyl)nicotinamide | CHEMBL568676
TypeSmall organic molecule
Emp. Form.C31H35ClN6O2
Mol. Mass.559.102
SMILESClc1cc(cnc1N1CCN(CC1)C1CCN(Cc2ccc(cc2)C#N)CC1)C(=O)NCCOc1ccccc1