Reaction Details
TargetHistamine H1 receptor
LigandBDBM22874
Substrate/Competitorn/a
Meas. Tech.ChEMBL_599955 (CHEMBL1048093)
Ki 27±n/a nM
Citation Aslanian, RPiwinski, JJZhu, XPriestley, TSorota, SDu, XYZhang, XSMcLeod, RLWest, REWilliams, SMHey, JA Structural determinants for histamine H(1) affinity, hERG affinity and QTc prolongation in a series of terfenadine analogs. Bioorg Med Chem Lett19:5043-7 (2009) 
 
Histamine H1 receptor
Name:Histamine H1 receptor
Type:G Protein-Coupled Receptor (GPCR)
Mol. Mass.:55808.72
Organism:Homo sapiens (Human)
Description:Cell pellets from SK-N-MC cells transfected with human H1 receptor were used in binding assay.
Residue:487
BDBM22874
NameBDBM22874
Synonyms:2-(4-{1-hydroxy-4-[4-(hydroxydiphenylmethyl)piperidin-1-yl]butyl}phenyl)-2-methylpropanoic acid Allegra Fexofenadine | MDL-16455
TypeSmall organic molecule
Emp. Form.C32H39NO4
Mol. Mass.501.6564
SMILESCC(C)(C(O)=O)c1ccc(cc1)C(O)CCCN1CCC(CC1)C(O)(c1ccccc1)c1ccccc1