Reaction Details
TargetHistamine H1 receptor
LigandBDBM50301397
Substrate/Competitorn/a
Meas. Tech.ChEMBL_599955 (CHEMBL1048093)
Ki 16±n/a nM
Citation Aslanian, RPiwinski, JJZhu, XPriestley, TSorota, SDu, XYZhang, XSMcLeod, RLWest, REWilliams, SMHey, JA Structural determinants for histamine H(1) affinity, hERG affinity and QTc prolongation in a series of terfenadine analogs. Bioorg Med Chem Lett19:5043-7 (2009) 
 
Histamine H1 receptor
Name:Histamine H1 receptor
Type:G Protein-Coupled Receptor (GPCR)
Mol. Mass.:55808.72
Organism:Homo sapiens (Human)
Description:Cell pellets from SK-N-MC cells transfected with human H1 receptor were used in binding assay.
Residue:487
BDBM50301397
NameBDBM50301397
Synonyms:CHEMBL571390 | [1-(4-Methyl-benzyl)-piperidin-4-yl]-diphenyl-methanol
TypeSmall organic molecule
Emp. Form.C26H29NO
Mol. Mass.371.5146
SMILESCc1ccc(CN2CCC(CC2)C(O)(c2ccccc2)c2ccccc2)cc1