Reaction Details
TargetMacrophage metalloelastase
LigandBDBM50215926
Substrate/Competitorn/a
Meas. Tech.ChEMBL_600205 (CHEMBL1046363)
IC50 3660±n/a nM
Citation Ando, NTerashima, S Synthesis of novel ageladine A analogs showing more potent matrix metalloproteinase (MMP)-12 inhibitory activity than the natural product. Bioorg Med Chem Lett19:5461-3 (2009) 
 
Macrophage metalloelastase
Name:Macrophage metalloelastase
Type:Enzyme
Mol. Mass.:54012.99
Organism:Homo sapiens (Human)
Description:P39900
Residue:470
BDBM50215926
NameBDBM50215926
Synonyms:4-(4,5-dibromo-1H-pyrrol-2-yl)-1H-imidazo[4,5-c]pyridin-2-amine CHEMBL230806
TypeSmall organic molecule
Emp. Form.C10H7Br2N5
Mol. Mass.357.004
SMILESNc1nc2c(nccc2[nH]1)-c1cc(Br)c(Br)[nH]1