Reaction Details
Target5-hydroxytryptamine receptor 2A
LigandBDBM50301494
Substrate/Competitorn/a
Meas. Tech.ChEMBL_600346 (CHEMBL1041064)
Ki 0.54±n/a nM
Citation Dosa, PIStrah-Pleynet, SJayakumar, HCasper, MDecaire, MXiong, YLehmann, JChoi, KElwell, KWong, AWebb, RRAdams, JWRamirez, JRichman, JGThomsen, WSemple, GTeegarden, BR Solubilized phenyl-pyrazole ureas as potent, selective 5-HT(2A) inverse-agonists and their application as antiplatelet agents. Bioorg Med Chem Lett19:5486-9 (2009) 
 
5-hydroxytryptamine receptor 2A
Name:5-hydroxytryptamine receptor 2A
Type:undefined
Mol. Mass.:52607.65
Organism:Homo sapiens (Human)
Description:P28223
Residue:471
BDBM50301494
NameBDBM50301494
Synonyms:1-(4-methoxyphenyl)-3-(3-(1-methyl-1H-pyrazol-5-yl)-4-(2-(piperidin-1-yl)ethoxy)phenyl)urea | CHEMBL568314
TypeSmall organic molecule
Emp. Form.C25H31N5O3
Mol. Mass.449.5453
SMILESCOc1ccc(NC(=O)Nc2ccc(OCCN3CCCCC3)c(c2)-c2ccnn2C)cc1