Reaction Details
Target5-hydroxytryptamine receptor 2A
LigandBDBM50301502
Substrate/Competitorn/a
Meas. Tech.ChEMBL_600346 (CHEMBL1041064)
Ki 0.18±n/a nM
Citation Dosa, PIStrah-Pleynet, SJayakumar, HCasper, MDecaire, MXiong, YLehmann, JChoi, KElwell, KWong, AWebb, RRAdams, JWRamirez, JRichman, JGThomsen, WSemple, GTeegarden, BR Solubilized phenyl-pyrazole ureas as potent, selective 5-HT(2A) inverse-agonists and their application as antiplatelet agents. Bioorg Med Chem Lett19:5486-9 (2009) 
 
5-hydroxytryptamine receptor 2A
Name:5-hydroxytryptamine receptor 2A
Type:undefined
Mol. Mass.:52607.65
Organism:Homo sapiens (Human)
Description:P28223
Residue:471
BDBM50301502
NameBDBM50301502
Synonyms:1-(3-(4-bromo-1-methyl-1H-pyrazol-5-yl)-4-(2-(pyrrolidin-1-yl)ethoxy)phenyl)-3-(2,4-difluorophenyl)urea | CHEMBL569518
TypeSmall organic molecule
Emp. Form.C23H24BrF2N5O2
Mol. Mass.520.37
SMILESCn1ncc(Br)c1-c1cc(NC(=O)Nc2ccc(F)cc2F)ccc1OCCN1CCCC1