Reaction Details
Target5-hydroxytryptamine receptor 2A
LigandBDBM50301505
Substrate/Competitorn/a
Meas. Tech.ChEMBL_600346 (CHEMBL1041064)
Ki 1.9±n/a nM
Citation Dosa, PIStrah-Pleynet, SJayakumar, HCasper, MDecaire, MXiong, YLehmann, JChoi, KElwell, KWong, AWebb, RRAdams, JWRamirez, JRichman, JGThomsen, WSemple, GTeegarden, BR Solubilized phenyl-pyrazole ureas as potent, selective 5-HT(2A) inverse-agonists and their application as antiplatelet agents. Bioorg Med Chem Lett19:5486-9 (2009) 
 
5-hydroxytryptamine receptor 2A
Name:5-hydroxytryptamine receptor 2A
Type:undefined
Mol. Mass.:52607.65
Organism:Homo sapiens (Human)
Description:P28223
Residue:471
BDBM50301505
NameBDBM50301505
Synonyms:1-(3-(4-bromo-1-methyl-1H-pyrazol-5-yl)-4-(2-(pyrrolidin-1-yl)ethoxy)phenyl)-3-(4-hydroxyphenyl)urea | CHEMBL568109
TypeSmall organic molecule
Emp. Form.C23H26BrN5O3
Mol. Mass.500.388
SMILESCn1ncc(Br)c1-c1cc(NC(=O)Nc2ccc(O)cc2)ccc1OCCN1CCCC1