Reaction Details
Target5-hydroxytryptamine receptor 2A
LigandBDBM50301507
Substrate/Competitorn/a
Meas. Tech.ChEMBL_600346 (CHEMBL1041064)
Ki 0.31±n/a nM
Citation Dosa, PIStrah-Pleynet, SJayakumar, HCasper, MDecaire, MXiong, YLehmann, JChoi, KElwell, KWong, AWebb, RRAdams, JWRamirez, JRichman, JGThomsen, WSemple, GTeegarden, BR Solubilized phenyl-pyrazole ureas as potent, selective 5-HT(2A) inverse-agonists and their application as antiplatelet agents. Bioorg Med Chem Lett19:5486-9 (2009) 
 
5-hydroxytryptamine receptor 2A
Name:5-hydroxytryptamine receptor 2A
Type:undefined
Mol. Mass.:52607.65
Organism:Homo sapiens (Human)
Description:P28223
Residue:471
BDBM50301507
NameBDBM50301507
Synonyms:1-(3-(4-chloro-1-methyl-1H-pyrazol-5-yl)-4-(2-morpholinoethoxy)phenyl)-3-(3,5-difluorophenyl)urea | CHEMBL576055
TypeSmall organic molecule
Emp. Form.C23H24ClF2N5O3
Mol. Mass.491.918
SMILESCn1ncc(Cl)c1-c1cc(NC(=O)Nc2cc(F)cc(F)c2)ccc1OCCN1CCOCC1