Reaction Details
Target5-hydroxytryptamine receptor 2C
LigandBDBM50301509
Substrate/Competitorn/a
Meas. Tech.ChEMBL_600347 (CHEMBL1041065)
Ki 1.6±n/a nM
Citation Dosa, PIStrah-Pleynet, SJayakumar, HCasper, MDecaire, MXiong, YLehmann, JChoi, KElwell, KWong, AWebb, RRAdams, JWRamirez, JRichman, JGThomsen, WSemple, GTeegarden, BR Solubilized phenyl-pyrazole ureas as potent, selective 5-HT(2A) inverse-agonists and their application as antiplatelet agents. Bioorg Med Chem Lett19:5486-9 (2009) 
 
5-hydroxytryptamine receptor 2C
Name:5-hydroxytryptamine receptor 2C
Type:G Protein-Coupled Receptor (GPCR)
Mol. Mass.:51836.79
Organism:Homo sapiens (Human)
Description:P28335
Residue:458
BDBM50301509
NameBDBM50301509
Synonyms:1-(3-(4-bromo-1-methyl-1H-pyrazol-5-yl)-4-(2-(pyrrolidin-1-yl)ethoxy)phenyl)-3-(4-chlorophenyl)urea | CHEMBL569475
TypeSmall organic molecule
Emp. Form.C23H25BrClN5O2
Mol. Mass.518.834
SMILESCn1ncc(Br)c1-c1cc(NC(=O)Nc2ccc(Cl)cc2)ccc1OCCN1CCCC1