Reaction Details
TargetMetabotropic glutamate receptor 1
LigandBDBM50301542
Substrate/Competitorn/a
Meas. Tech.ChEMBL_600490 (CHEMBL1046437)
IC50 1.8±n/a nM
Citation Satoh, ANagatomi, YHirata, YIto, SSuzuki, GKimura, TMaehara, SHikichi, HSatow, AHata, MOhta, HKawamoto, H Discovery and in vitro and in vivo profiles of 4-fluoro-N-[4-[6-(isopropylamino)pyrimidin-4-yl]-1,3-thiazol-2-yl]-N-methylbenzamide as novel class of an orally active metabotropic glutamate receptor 1 (mGluR1) antagonist. Bioorg Med Chem Lett19:5464-8 (2009) 
 
Metabotropic glutamate receptor 1
Name:Metabotropic glutamate receptor 1
Type:Enzyme
Mol. Mass.:132358.19
Organism:Homo sapiens (Human)
Description:Q13255
Residue:1194
BDBM50301542
NameBDBM50301542
Synonyms:4-fluoro-N-methyl-N-(4-(6-(methylamino)pyrimidin-4-yl)thiazol-2-yl)benzamide | CHEMBL569270
TypeSmall organic molecule
Emp. Form.C16H14FN5OS
Mol. Mass.343.379
SMILESCNc1cc(ncn1)-c1csc(n1)N(C)C(=O)c1ccc(F)cc1