Reaction Details
TargetProthrombin
LigandBDBM50301558
Substrate/Competitorn/a
Meas. Tech.ChEMBL_600518 (CHEMBL1049043)
IC50 11±n/a nM
Citation Hanessian, STherrien, EZhang, JOtterlo, WXue, YGustafsson, DNilsson, IFjellström, O From natural products to achiral drug prototypes: potent thrombin inhibitors based on P2/P3 dihydropyrid-2-one core motifs. Bioorg Med Chem Lett19:5429-32 (2009) 
 
Prothrombin
Name:Prothrombin
Type:Protein
Mol. Mass.:70029.57
Organism:Homo sapiens (Human)
Description:P00734
Residue:622
BDBM50301558
NameBDBM50301558
Synonyms:CHEMBL565292 | N-(4-carbamimidoylbenzyl)-2-(1-(3-methoxyphenylsulfonamido)-4-methyl-2-oxo-1,2,5,6-tetrahydropyridin-3-yl)acetamide
TypeSmall organic molecule
Emp. Form.C23H27N5O5S
Mol. Mass.485.556
SMILESCOc1cccc(c1)S(=O)(=O)NN1CCC(C)=C(CC(=O)NCc2ccc(cc2)C(N)=N)C1=O