Reaction Details
TargetProthrombin
LigandBDBM50301571
Substrate/Competitorn/a
Meas. Tech.ChEMBL_600518 (CHEMBL1049043)
IC50 3.3±n/a nM
Citation Hanessian, STherrien, EZhang, JOtterlo, WXue, YGustafsson, DNilsson, IFjellström, O From natural products to achiral drug prototypes: potent thrombin inhibitors based on P2/P3 dihydropyrid-2-one core motifs. Bioorg Med Chem Lett19:5429-32 (2009) 
 
Prothrombin
Name:Prothrombin
Type:Protein
Mol. Mass.:70029.57
Organism:Homo sapiens (Human)
Description:P00734
Residue:622
BDBM50301571
NameBDBM50301571
Synonyms:(2S,3aS,7aS)-N-(4-carbamimidoylbenzyl)-1-((2R,3R)-2-((R)-2-hydroxy-3-phenylpropanamido)-3-methylpentanoyl)octahydro-1H-indole-2-carboxamide | CHEMBL565466
TypeSmall organic molecule
Emp. Form.C32H43N5O4
Mol. Mass.561.7149
SMILESCC[C@@H](C)[C@@H](NC(=O)[C@H](O)Cc1ccccc1)C(=O)N1[C@H]2CCCC[C@H]2C[C@H]1C(=O)NCc1ccc(cc1)C(N)=N