Reaction Details
TargetProthrombin
LigandBDBM50301574
Substrate/Competitorn/a
Meas. Tech.ChEMBL_600518 (CHEMBL1049043)
IC50 5.8±n/a nM
Citation Hanessian, STherrien, EZhang, JOtterlo, WXue, YGustafsson, DNilsson, IFjellström, O From natural products to achiral drug prototypes: potent thrombin inhibitors based on P2/P3 dihydropyrid-2-one core motifs. Bioorg Med Chem Lett19:5429-32 (2009) 
 
Prothrombin
Name:Prothrombin
Type:Protein
Mol. Mass.:70029.57
Organism:Homo sapiens (Human)
Description:P00734
Residue:622
BDBM50301574
NameBDBM50301574
Synonyms:CHEMBL568990 | Chlorodysinosin A
TypeSmall organic molecule
Emp. Form.C26H43ClN6O10S
Mol. Mass.667.172
SMILES[#6]-[#8]-[#6@H](-[#6]-[#8]S([#8-])(=O)=O)-[#6](=O)-[#7]-[#6@H](-[#6@H](Cl)-[#6](-[#6])-[#6])-[#6](=O)-[#7]-1-[#6@H]-2-[#6]-[#6@H](-[#8])-[#6@@H](-[#8])-[#6]-[#6@H]-2-[#6]-[#6@H]-1-[#6](=O)-[#7]-[#6]-[#6]-[#6]-1=[#6]-[#6]\[#7+](-[#6]-1)=[#6](\[#7])-[#7]