Reaction Details
TargetTyrosine-protein kinase Lck
LigandBDBM50301587
Substrate/Competitorn/a
Meas. Tech.ChEMBL_600521 (CHEMBL1049046)
IC50 1±n/a nM
Citation Hunt, JABeresis, RTGoulet, JLHolmes, MAHong, XJKovacs, EMills, SGRuzek, RDWong, FHermes, JDPark, YWSalowe, SPSonatore, LMWu, LWoods, AZaller, DMSinclair, PJ Disubstituted pyrimidines as Lck inhibitors. Bioorg Med Chem Lett19:5440-3 (2009) 
 
Tyrosine-protein kinase Lck
Name:Tyrosine-protein kinase Lck
Type:n/a
Mol. Mass.:57987.83
Organism:Homo sapiens (Human)
Description:P06239
Residue:509
BDBM50301587
NameBDBM50301587
Synonyms:CHEMBL567885 | rac 3-(1-(4-(1H-benzo[d]imidazol-1-yl)pyrimidin-2-ylamino)ethyl)-N-(naphthalen-1-yl)piperidine-1-carboxamide
TypeSmall organic molecule
Emp. Form.C29H29N7O
Mol. Mass.491.5869
SMILESCC(Nc1nccc(n1)-n1cnc2ccccc12)C1CCCN(C1)C(=O)Nc1cccc2ccccc12