Reaction Details
TargetTyrosine-protein kinase Lck
LigandBDBM50301607
Substrate/Competitorn/a
Meas. Tech.ChEMBL_600521 (CHEMBL1049046)
IC50 0.2±n/a nM
Citation Hunt, JABeresis, RTGoulet, JLHolmes, MAHong, XJKovacs, EMills, SGRuzek, RDWong, FHermes, JDPark, YWSalowe, SPSonatore, LMWu, LWoods, AZaller, DMSinclair, PJ Disubstituted pyrimidines as Lck inhibitors. Bioorg Med Chem Lett19:5440-3 (2009) 
 
Tyrosine-protein kinase Lck
Name:Tyrosine-protein kinase Lck
Type:n/a
Mol. Mass.:57987.83
Organism:Homo sapiens (Human)
Description:P06239
Residue:509
BDBM50301607
NameBDBM50301607
Synonyms:(S)-3-((S)-1-(4-(1H-benzo[d]imidazol-1-yl)pyrimidin-2-ylamino)ethyl)-N-(naphthalen-1-yl)-4-(pyridin-4-yl)piperazine-1-carboxamide | CHEMBL565263
TypeSmall organic molecule
Emp. Form.C33H31N9O
Mol. Mass.569.6589
SMILESC[C@H](Nc1nccc(n1)-n1cnc2ccccc12)[C@@H]1CN(CCN1c1ccncc1)C(=O)Nc1cccc2ccccc12