Reaction Details
TargetTyrosine-protein kinase Lck
LigandBDBM50301623
Substrate/Competitorn/a
Meas. Tech.ChEMBL_600521 (CHEMBL1049046)
IC50 3±n/a nM
Citation Hunt, JABeresis, RTGoulet, JLHolmes, MAHong, XJKovacs, EMills, SGRuzek, RDWong, FHermes, JDPark, YWSalowe, SPSonatore, LMWu, LWoods, AZaller, DMSinclair, PJ Disubstituted pyrimidines as Lck inhibitors. Bioorg Med Chem Lett19:5440-3 (2009) 
 
Tyrosine-protein kinase Lck
Name:Tyrosine-protein kinase Lck
Type:n/a
Mol. Mass.:57987.83
Organism:Homo sapiens (Human)
Description:P06239
Residue:509
BDBM50301623
NameBDBM50301623
Synonyms:(S)-N-(1-phenylethyl)-4-(5-(pyridin-4-yl)-1H-benzo[d]imidazol-1-yl)pyrimidin-2-amine | CHEMBL584721
TypeSmall organic molecule
Emp. Form.C24H20N6
Mol. Mass.392.4558
SMILESC[C@H](Nc1nccc(n1)-n1cnc2cc(ccc12)-c1ccncc1)c1ccccc1