Reaction Details
TargetProtein kinase C theta type
LigandBDBM50301687
Substrate/Competitorn/a
Meas. Tech.ChEMBL_600772 (CHEMBL1037484)
IC50 12±n/a nM
Citation Subrath, JWang, DWu, BNiu, CBoschelli, DHLee, JYang, XBrennan, AChaudhary, D C-5 Substituted heteroaryl 3-pyridinecarbonitriles as PKCtheta inhibitors: Part I. Bioorg Med Chem Lett19:5423-5 (2009) 
 
Protein kinase C theta type
Name:Protein kinase C theta type
Type:Serine/threonine-protein kinase
Mol. Mass.:81878.04
Organism:Homo sapiens (Human)
Description:Full-length human PKC theta (Panvera Catalog No. P2996).
Residue:706
BDBM50301687
NameBDBM50301687
Synonyms:4-(4-methyl-1H-indol-5-ylamino)-5-(5-((4-methylpiperazin-1-yl)methyl)furan-3-yl)nicotinonitrile | CHEMBL568547
TypeSmall organic molecule
Emp. Form.C25H26N6O
Mol. Mass.426.5135
SMILESCN1CCN(Cc2cc(co2)-c2cncc(C#N)c2Nc2ccc3[nH]ccc3c2C)CC1