Reaction Details
TargetProtein kinase C theta type
LigandBDBM50301695
Substrate/Competitorn/a
Meas. Tech.ChEMBL_600772 (CHEMBL1037484)
IC50 3.5±n/a nM
Citation Subrath, JWang, DWu, BNiu, CBoschelli, DHLee, JYang, XBrennan, AChaudhary, D C-5 Substituted heteroaryl 3-pyridinecarbonitriles as PKCtheta inhibitors: Part I. Bioorg Med Chem Lett19:5423-5 (2009) 
 
Protein kinase C theta type
Name:Protein kinase C theta type
Type:Serine/threonine-protein kinase
Mol. Mass.:81878.04
Organism:Homo sapiens (Human)
Description:Full-length human PKC theta (Panvera Catalog No. P2996).
Residue:706
BDBM50301695
NameBDBM50301695
Synonyms:5-(5-((4-cyclopentylpiperazin-1-yl)methyl)furan-3-yl)-4-(4-methyl-1H-indol-5-ylamino)nicotinonitrile | CHEMBL568581
TypeSmall organic molecule
Emp. Form.C29H32N6O
Mol. Mass.480.604
SMILESCc1c(Nc2c(cncc2-c2coc(CN3CCN(CC3)C3CCCC3)c2)C#N)ccc2[nH]ccc12