Reaction Details
TargetProtein kinase C delta type
LigandBDBM50301678
Substrate/Competitorn/a
Meas. Tech.ChEMBL_600775 (CHEMBL1037487)
IC50 25±n/a nM
Citation Subrath, JWang, DWu, BNiu, CBoschelli, DHLee, JYang, XBrennan, AChaudhary, D C-5 Substituted heteroaryl 3-pyridinecarbonitriles as PKCtheta inhibitors: Part I. Bioorg Med Chem Lett19:5423-5 (2009) 
 
Protein kinase C delta type
Name:Protein kinase C delta type
Type:Enzyme
Mol. Mass.:77516.79
Organism:Homo sapiens (Human)
Description:The recombinant human PKC enzymes were produced using a baculovirus expression system in SF9 cells
Residue:676
BDBM50301678
NameBDBM50301678
Synonyms:4-(4-methyl-1H-indol-5-ylamino)-5-(4-((4-methylpiperazin-1-yl)methyl)phenyl)nicotinonitrile | CHEMBL567299
TypeSmall organic molecule
Emp. Form.C27H28N6
Mol. Mass.436.5514
SMILESCN1CCN(Cc2ccc(cc2)-c2cncc(C#N)c2Nc2ccc3[nH]ccc3c2C)CC1