Reaction Details
TargetProtein kinase C delta type
LigandBDBM50301680
Substrate/Competitorn/a
Meas. Tech.ChEMBL_600775 (CHEMBL1037487)
IC50 70±n/a nM
Citation Subrath, JWang, DWu, BNiu, CBoschelli, DHLee, JYang, XBrennan, AChaudhary, D C-5 Substituted heteroaryl 3-pyridinecarbonitriles as PKCtheta inhibitors: Part I. Bioorg Med Chem Lett19:5423-5 (2009) 
 
Protein kinase C delta type
Name:Protein kinase C delta type
Type:Enzyme
Mol. Mass.:77516.79
Organism:Homo sapiens (Human)
Description:The recombinant human PKC enzymes were produced using a baculovirus expression system in SF9 cells
Residue:676
BDBM50301680
NameBDBM50301680
Synonyms:4-(4-methyl-1H-indol-5-ylamino)-5-(4-(morpholinomethyl)phenyl)nicotinonitrile | CHEMBL586046
TypeSmall organic molecule
Emp. Form.C26H25N5O
Mol. Mass.423.5096
SMILESCc1c(Nc2c(cncc2-c2ccc(CN3CCOCC3)cc2)C#N)ccc2[nH]ccc12