Reaction Details
TargetSodium channel protein type 9 subunit alpha
LigandBDBM50301711
Substrate/Competitorn/a
Meas. Tech.ChEMBL_597903 (CHEMBL1042688)
IC50 20±n/a nM
Citation Shao, PPYe, FWeber, AELi, XLyons, KAParsons, WHGarcia, MLPriest, BTSmith, MMFelix, JPWilliams, BSKaczorowski, GJMcGowan, EAbbadie, CMartin, WJMcMasters, DRGao, YD Discovery of isoxazole voltage gated sodium channel blockers for treatment of chronic pain. Bioorg Med Chem Lett19:5334-8 (2009) 
 
Sodium channel protein type 9 subunit alpha
Name:Sodium channel protein type 9 subunit alpha
Type:Protein
Mol. Mass.:226375.97
Organism:Homo sapiens (Human)
Description:Q15858
Residue:1988
BDBM50301711
NameBDBM50301711
Synonyms:(1R,2R)-2-(5-(3-methoxyphenyl)isoxazol-3-yl)-N-(1-phenylcyclobutyl)cyclopentanecarboxamide | CHEMBL585204
TypeSmall organic molecule
Emp. Form.C26H28N2O3
Mol. Mass.416.5121
SMILESCOc1cccc(c1)-c1cc(no1)[C@@H]1CCC[C@H]1C(=O)NC1(CCC1)c1ccccc1