Reaction Details
TargetCannabinoid receptor 1
LigandBDBM50301740
Substrate/Competitorn/a
Meas. Tech.ChEMBL_597913 (CHEMBL1042698)
Ki 14±n/a nM
Citation Dow, RLHadcock, JRScott, DOSchneider, SRPaight, ESIredale, PACarpino, PAGriffith, DAHammond, MDasilva-Jardine, P Bioisosteric replacement of the hydrazide pharmacophore of the cannabinoid-1 receptor antagonist SR141716A. Part I: potent, orally-active 1,4-disubstituted imidazoles. Bioorg Med Chem Lett19:5351-4 (2009) 
 
Cannabinoid receptor 1
Name:Cannabinoid receptor 1
Type:G Protein-Coupled Receptor (GPCR)
Mol. Mass.:52856.55
Organism:Rattus norvegicus (rat)
Description:P20272
Residue:473
BDBM50301740
NameBDBM50301740
Synonyms:3-(1-benzyl-1H-imidazol-4-yl)-5-(4-chlorophenyl)-1-(2,4-dichlorophenyl)-4-methyl-1H-pyrazole | CHEMBL576230
TypeSmall organic molecule
Emp. Form.C26H19Cl3N4
Mol. Mass.493.815
SMILESCc1c(nn(c1-c1ccc(Cl)cc1)-c1ccc(Cl)cc1Cl)-c1cn(Cc2ccccc2)cn1