Reaction Details
TargetCannabinoid receptor 1
LigandBDBM50301746
Substrate/Competitorn/a
Meas. Tech.ChEMBL_597913 (CHEMBL1042698)
Ki 8.6±n/a nM
Citation Dow, RLHadcock, JRScott, DOSchneider, SRPaight, ESIredale, PACarpino, PAGriffith, DAHammond, MDasilva-Jardine, P Bioisosteric replacement of the hydrazide pharmacophore of the cannabinoid-1 receptor antagonist SR141716A. Part I: potent, orally-active 1,4-disubstituted imidazoles. Bioorg Med Chem Lett19:5351-4 (2009) 
 
Cannabinoid receptor 1
Name:Cannabinoid receptor 1
Type:G Protein-Coupled Receptor (GPCR)
Mol. Mass.:52856.55
Organism:Rattus norvegicus (rat)
Description:P20272
Residue:473
BDBM50301746
NameBDBM50301746
Synonyms:5-(4-chlorophenyl)-3-(1-cyclohexyl-1H-imidazol-4-yl)-1-(2,4-dichlorophenyl)-4-methyl-1H-pyrazole | CHEMBL585095
TypeSmall organic molecule
Emp. Form.C25H23Cl3N4
Mol. Mass.485.836
SMILESCc1c(nn(c1-c1ccc(Cl)cc1)-c1ccc(Cl)cc1Cl)-c1cn(cn1)C1CCCCC1