Reaction Details
TargetCannabinoid receptor 1
LigandBDBM50301747
Substrate/Competitorn/a
Meas. Tech.ChEMBL_597914 (CHEMBL1042699)
Ki 0.1±n/a nM
Citation Dow, RLHadcock, JRScott, DOSchneider, SRPaight, ESIredale, PACarpino, PAGriffith, DAHammond, MDasilva-Jardine, P Bioisosteric replacement of the hydrazide pharmacophore of the cannabinoid-1 receptor antagonist SR141716A. Part I: potent, orally-active 1,4-disubstituted imidazoles. Bioorg Med Chem Lett19:5351-4 (2009) 
 
Cannabinoid receptor 1
Name:Cannabinoid receptor 1
Type:G Protein-Coupled Receptor (GPCR)
Mol. Mass.:52868.96
Organism:Homo sapiens (Human)
Description:P21554
Residue:472
BDBM50301747
NameBDBM50301747
Synonyms:1-(2-chlorophenyl)-5-(4-chlorophenyl)-4-methyl-3-(1-(2-phenylpropan-2-yl)-1H-imidazol-4-yl)-1H-pyrazole | CHEMBL578969
TypeSmall organic molecule
Emp. Form.C28H24Cl2N4
Mol. Mass.487.423
SMILESCc1c(nn(c1-c1ccc(Cl)cc1)-c1ccccc1Cl)-c1cn(cn1)C(C)(C)c1ccccc1