Reaction Details
Target5-hydroxytryptamine receptor 2A
LigandBDBM50301770
Substrate/Competitorn/a
Meas. Tech.ChEMBL_598089 (CHEMBL1049779)
EC50>1500±n/a nM
Citation Andrews, MDGreen, MPAllerton, CMBatchelor, DVBlagg, JBrown, ADGordon, DWMcMurray, GMillns, DJNichols, CLWatson, L Design and synthesis of piperazinylpyrimidinones as novel selective 5-HT(2C) agonists. Bioorg Med Chem Lett19:5346-50 (2009) 
 
5-hydroxytryptamine receptor 2A
Name:5-hydroxytryptamine receptor 2A
Type:undefined
Mol. Mass.:52607.65
Organism:Homo sapiens (Human)
Description:P28223
Residue:471
BDBM50301770
NameBDBM50301770
Synonyms:(R)-3-methyl-6-(2-methylpiperazin-1-yl)-2-((2-(trifluoromethyl)phenoxy)methyl)pyrimidin-4(3H)-one | CHEMBL568237
TypeSmall organic molecule
Emp. Form.C18H21F3N4O2
Mol. Mass.382.3801
SMILESC[C@@H]1CNCCN1c1cc(=O)n(C)c(COc2ccccc2C(F)(F)F)n1