Reaction Details
Target5-hydroxytryptamine receptor 2C
LigandBDBM50301784
Substrate/Competitorn/a
Meas. Tech.ChEMBL_598082 (CHEMBL1049772)
EC50 26±n/a nM
Citation Andrews, MDGreen, MPAllerton, CMBatchelor, DVBlagg, JBrown, ADGordon, DWMcMurray, GMillns, DJNichols, CLWatson, L Design and synthesis of piperazinylpyrimidinones as novel selective 5-HT(2C) agonists. Bioorg Med Chem Lett19:5346-50 (2009) 
 
5-hydroxytryptamine receptor 2C
Name:5-hydroxytryptamine receptor 2C
Type:G Protein-Coupled Receptor (GPCR)
Mol. Mass.:51836.79
Organism:Homo sapiens (Human)
Description:P28335
Residue:458
BDBM50301784
NameBDBM50301784
Synonyms:(R)-2-(3-chlorophenethyl)-3-methyl-6-(2-methylpiperazin-1-yl)pyrimidin-4(3H)-one | CHEMBL583193
TypeSmall organic molecule
Emp. Form.C18H23ClN4O
Mol. Mass.346.854
SMILESC[C@@H]1CNCCN1c1cc(=O)n(C)c(CCc2cccc(Cl)c2)n1