Reaction Details
Target5-hydroxytryptamine receptor 2C
LigandBDBM50301797
Substrate/Competitorn/a
Meas. Tech.ChEMBL_598082 (CHEMBL1049772)
EC50>10000±n/a nM
Citation Andrews, MDGreen, MPAllerton, CMBatchelor, DVBlagg, JBrown, ADGordon, DWMcMurray, GMillns, DJNichols, CLWatson, L Design and synthesis of piperazinylpyrimidinones as novel selective 5-HT(2C) agonists. Bioorg Med Chem Lett19:5346-50 (2009) 
 
5-hydroxytryptamine receptor 2C
Name:5-hydroxytryptamine receptor 2C
Type:G Protein-Coupled Receptor (GPCR)
Mol. Mass.:51836.79
Organism:Homo sapiens (Human)
Description:P28335
Residue:458
BDBM50301797
NameBDBM50301797
Synonyms:3-methyl-6-(piperazin-1-yl)-2-((4-(trifluoromethyl)phenoxy)methyl)pyrimidin-4(3H)-one | CHEMBL576433
TypeSmall organic molecule
Emp. Form.C17H19F3N4O2
Mol. Mass.368.3536
SMILESCn1c(COc2ccc(cc2)C(F)(F)F)nc(cc1=O)N1CCNCC1